[Alsaplayer-devel]compile errors using alsa-driver-0.9.0beta4

Patrick Shirkey pshirkey@boosthardware.com
Tue, 12 Jun 2001 01:25:35 -0400


This output may be of interest to you.
-------
alsa.c: In function `alsa_write':
alsa.c:68: storage size of `status' isn't known
alsa.c: In function `alsa_set_buffer':
alsa.c:92: sizeof applied to an incomplete type
alsa.c:92: sizeof applied to an incomplete type
alsa.c:92: sizeof applied to an incomplete type
alsa.c:92: sizeof applied to an incomplete type
alsa.c:92: sizeof applied to an incomplete type
alsa.c:92: sizeof applied to an incomplete type
alsa.c:93: sizeof applied to an incomplete type
alsa.c:93: sizeof applied to an incomplete type
alsa.c:93: sizeof applied to an incomplete type
alsa.c:93: sizeof applied to an incomplete type
alsa.c:93: sizeof applied to an incomplete type
alsa.c:93: sizeof applied to an incomplete type
alsa.c:95: invalid use of incomplete typedef `snd_pcm_hw_params_t'
alsa.c:96: invalid use of incomplete typedef `snd_pcm_hw_params_t'
alsa.c:97: invalid use of incomplete typedef `snd_pcm_hw_params_t'
alsa.c:98: invalid use of incomplete typedef `snd_pcm_hw_params_t'
alsa.c:99: invalid use of incomplete typedef `snd_pcm_hw_params_t'
alsa.c:100: invalid use of incomplete typedef `snd_pcm_hw_params_t'
alsa.c:102: invalid use of incomplete typedef `snd_pcm_sw_params_t'
alsa.c:103: invalid use of incomplete typedef `snd_pcm_sw_params_t'
alsa.c:103: `SND_PCM_READY_FRAGMENT' undeclared (first use in this
function)
alsa.c:103: (Each undeclared identifier is reported only once
alsa.c:103: for each function it appears in.)
alsa.c:104: invalid use of incomplete typedef `snd_pcm_sw_params_t'
alsa.c:105: invalid use of incomplete typedef `snd_pcm_sw_params_t'
alsa.c:105: `SND_PCM_XRUN_FRAGMENT' undeclared (first use in this
function)
alsa.c:106: invalid use of incomplete typedef `snd_pcm_sw_params_t'
alsa.c: At top level:
alsa.c:32: storage size of `hwparams' isn't known
alsa.c:33: storage size of `swparams' isn't known
make[2]: *** [alsa.lo] Error 1
make[2]: Leaving directory
`/usr/local/alsa/alsaplayer-0.99.33-pre2/output/alsa-0.6.x'
make[1]: *** [install-recursive] Error 1
make[1]: Leaving directory
`/usr/local/alsa/alsaplayer-0.99.33-pre2/output'
make: *** [install-recursive] Error 1    
-------



-- 
Patrick Shirkey - Manager Boost Hardware.
Importing Korean Computer Hardware to New Zealand.

Http://www.boosthardware.com for cool toys to fufill every geeks
fantasy.